Target
Beta-galactosidase
Ligand
BDBM50365006
Substrate
Meas. Tech.
ChEMBL_804689 (CHEMBL1953211)
IC50
600000±n/a nM
Citation
 Worawalai, WRattanangkool, EVanitcha, APhuwapraisirisan, PWacharasindhu, S Concise synthesis of (+)-conduritol F and inositol analogues from naturally available (+)-proto-quercitol and their glucosidase inhibitory activity. Bioorg Med Chem Lett 22:1538-40 (2012)  
Target
Name:
Beta-galactosidase
Synonyms:
Acid beta-galactosidase ELNR1 GLB1 | Lactase
Type:
PROTEIN
Mol. Mass.:
76074.43
Organism:
Homo sapiens (Human)
Description:
ChEMBL_215886
Residue:
677
  
Inhibitor
Name:
BDBM50365006
Synonyms:
CHEMBL1950779
Type:
Small organic molecule
Emp. Form.:
C6H10O4
Mol. Mass.:
146.1412
SMILES:
O[C@H]1C=C[C@@H](O)[C@H](O)[C@H]1O
: