Target
Lysosomal Pro-X carboxypeptidase
Ligand
BDBM50365012
Substrate
Meas. Tech.
ChEMBL_804690 (CHEMBL1953317)
IC50
31.0±n/a nM
Citation
 Wu, ZYang, CGraham, THVerras, AChabin, RMXu, STong, XXie, DLassman, MEBhatt, URGarcia-Calvo, MMShen, ZChen, QBleasby, KSinharoy, RHale, JJTata, JRPinto, SColletti, SLShen, DM Discovery of aminoheterocycles as potent and brain penetrant prolylcarboxypeptidase inhibitors. Bioorg Med Chem Lett 22:1727-30 (2012)  
Target
Name:
Lysosomal Pro-X carboxypeptidase
Synonyms:
Angiotensinase C PCP PRCP Prolylcarboxypeptidase | Prolylcarboxypeptidase (PRCP)
Type:
Enzyme
Mol. Mass.:
55805.19
Organism:
Homo sapiens (Human)
Description:
P42785
Residue:
496
  
Inhibitor
Name:
BDBM50365012
Synonyms:
CHEMBL1950916
Type:
Small organic molecule
Emp. Form.:
C21H29ClN4O
Mol. Mass.:
388.934
SMILES:
C[C@H](N(C)c1cc(ncn1)N1CCCC(C1)C(C)(C)O)c1ccc(Cl)cc1
: