Target
Histamine H3 receptor
Ligand
BDBM50365051
Substrate
Meas. Tech.
ChEMBL_804714 (CHEMBL1953341)
Ki
105±n/a nM
Citation
 Sundar, BGBailey, TRDunn, DHostetler, GAChatterjee, SBacon, ERYue, CSchweizer, DAimone, LDGruner, JALyons, JRaddatz, RLesur, B Novel morpholine ketone analogs as potent histamine H3 receptor inverse agonists with wake activity. Bioorg Med Chem Lett 22:1546-9 (2012)  
Target
Name:
Histamine H3 receptor
Synonyms:
HH3R Hrh3
Type:
G Protein-Coupled Receptor (GPCR)
Mol. Mass.:
48607.98
Organism:
Rattus norvegicus (rat)
Description:
Residue:
445
  
Inhibitor
Name:
BDBM50365051
Synonyms:
CHEMBL1951060
Type:
Small organic molecule
Emp. Form.:
C21H32N2O3
Mol. Mass.:
360.4904
SMILES:
CC(N1CCOCC1)C(=O)c1ccc(OCCCN2CCC[C@H]2C)cc1
: