Target
Bifunctional protein GlmU
Ligand
BDBM50365093
Substrate
Meas. Tech.
ChEMBL_804877 (CHEMBL1953925)
IC50
12000±n/a nM
Citation
 Green, OMMcKenzie, ARShapiro, ABOtterbein, LNi, HPatten, AStokes, SAlbert, RKawatkar, SBreed, J Inhibitors of acetyltransferase domain of N-acetylglucosamine-1-phosphate-uridyltransferase/glucosamine-1-phosphate-acetyltransferase (GlmU). Part 1: Hit to lead evaluation of a novel arylsulfonamide series. Bioorg Med Chem Lett 22:1510-9 (2012)  
Target
Name:
Bifunctional protein GlmU
Synonyms:
GLMU_STRPN N-acetylglucosamine-1-phosphate uridyltransferase glmU
Type:
PROTEIN
Mol. Mass.:
49335.99
Organism:
Streptococcus pneumoniae
Description:
ChEMBL_804877
Residue:
459
  
Inhibitor
Name:
BDBM50365093
Synonyms:
CHEMBL1951182
Type:
Small organic molecule
Emp. Form.:
C24H31N3O7S
Mol. Mass.:
505.584
SMILES:
COc1cc(OC)c(cc1NC(=O)CCC(O)=O)S(=O)(=O)NCc1ccccc1N1CCCCC1
: