Target
Prostaglandin G/H synthase 1
Ligand
BDBM50365165
Substrate
Meas. Tech.
ChEMBL_805486 (CHEMBL1955379)
IC50
150±n/a nM
Citation
 Hayashi, SUeno, NMurase, ANakagawa, YTakada, J Novel acid-type cyclooxygenase-2 inhibitors: Design, synthesis, and structure-activity relationship for anti-inflammatory drug. Eur J Med Chem 50:179-95 (2012)  
Target
Name:
Prostaglandin G/H synthase 1
Synonyms:
COX-1 Cyclooxygenase Cyclooxygenase-1 (COX-1) PTGS1 | Prostaglandin G/H synthase (cyclooxygenase)
Type:
Enzyme
Mol. Mass.:
68692.62
Organism:
Homo sapiens (Human)
Description:
P23219
Residue:
599
  
Inhibitor
Name:
BDBM50365165
Synonyms:
CHEMBL1950017
Type:
Small organic molecule
Emp. Form.:
C17H13FN2O3
Mol. Mass.:
312.2951
SMILES:
Cc1ccnc(c1)C(=O)c1[nH]c2ccc(F)cc2c1CC(O)=O
: