Target
Prostaglandin G/H synthase 2
Ligand
BDBM50365162
Substrate
Meas. Tech.
ChEMBL_805488 (CHEMBL1955381)
IC50
1900±n/a nM
Citation
 Hayashi, SUeno, NMurase, ANakagawa, YTakada, J Novel acid-type cyclooxygenase-2 inhibitors: Design, synthesis, and structure-activity relationship for anti-inflammatory drug. Eur J Med Chem 50:179-95 (2012)  
Target
Name:
Prostaglandin G/H synthase 2
Synonyms:
COX2 Cyclooxygenase 2 (COX-2) Cyclooxygenase-2 (COX-2 AA) Cyclooxygenase-2 (COX-2) PGH2_HUMAN PHS II Prostaglandin E synthase/G/H synthase 2 Prostaglandin-endoperoxide synthase 2
Type:
Enzyme
Mol. Mass.:
69003.89
Organism:
Homo sapiens (Human)
Description:
Recombinant Cox-2 provided by Cayman (Cayman Chemical Co.,Ann Arbor, MI).
Residue:
604
  
Inhibitor
Name:
BDBM50365162
Synonyms:
CHEMBL1950014
Type:
Small organic molecule
Emp. Form.:
C18H13F3N2O4
Mol. Mass.:
378.302
SMILES:
Cc1ccnc(c1)C(=O)c1[nH]c2ccc(OC(F)(F)F)cc2c1CC(O)=O
: