Target
Acetylcholinesterase
Ligand
BDBM50020522
Substrate
Meas. Tech.
ChEMBL_808150 (CHEMBL1960867)
Kd
24000±n/a nM
Citation
 Kalisiak, JRalph, ECZhang, JCashman, JR Amidine-oximes: reactivators for organophosphate exposure. J Med Chem 54:3319-30 (2011)  
Target
Name:
Acetylcholinesterase
Synonyms:
ACES_RAT Acetylcholinesterase and butyrylcholinesterase (AChE and BChE) Acetylcholinesterase, AChE | Ache
Type:
Enzyme
Mol. Mass.:
68193.62
Organism:
Rattus norvegicus (rat)
Description:
P37136
Residue:
614
  
Inhibitor
Name:
BDBM50020522
Synonyms:
1-(((4-carbamoylpyridinium-1-yl)methoxy)methyl)-2-((hydroxyimino)methyl)pyridinium chloride 1-(2-hydroxyiminomethylpyridinium)-3-(4-carbamoylpyridinium)-2-oxa-propane dichloride 4-(aminocarbonyl)-1-({[1-chloro-2-[(E)-(hydroxyimino)methyl]pyridinium-1(2H)-yl]methoxy}methyl)pyridinium; chloride 4-(aminocarbonyl)-1-[({2-[(E)-(hydroxyimino)methyl]pyridinium-1-yl}methoxy)methyl]pyridinium dichloride 4-(aminocarbonyl)-1-[({2-[(E)-(hydroxyimino)methyl]pyridinium-1-yl}methoxy)methyl]pyridinium dichloride[HI-6] 4-carbamoyl-2-((E)-(hydroxyimino)methyl)-1-(((2-((E)-(hydroxyimino)methyl)pyridinium-1-yl)methoxy)methyl)pyridinium chloride | CHEMBL33051
Type:
Small organic molecule
Emp. Form.:
C14H16N4O3
Mol. Mass.:
288.3007
SMILES:
NC(=O)c1cc[n+](COC[n+]2ccccc2CN=O)cc1
: