Target
5-hydroxytryptamine receptor 3A
Ligand
BDBM50365249
Substrate
Meas. Tech.
ChEMBL_805903 (CHEMBL1960084)
Ki
2.7±n/a nM
Citation
 Tao, MAimone, LDHuang, ZMathiasen, JRaddatz, RLyons, JHudkins, RL Optimization of 5-pyridazin-3-one phenoxypropylamines as potent, selective histamine H3 receptor antagonists with potent cognition enhancing activity. J Med Chem 55:414-23 (2012)  
Target
Name:
5-hydroxytryptamine receptor 3A
Synonyms:
5-HT-3 5-HT3A 5-hydroxytryptamine receptor 3 (5-HT3) 5-hydroxytryptamine receptor 3A (5HT3A) 5HT3R HTR3A Serotonin 3 receptor (5HT3) Serotonin-gated ion channel receptor | Serotonin-gated ion channel receptor 3
Type:
Protein
Mol. Mass.:
55283.27
Organism:
Homo sapiens (Human)
Description:
P46098
Residue:
478
  
Inhibitor
Name:
BDBM50365249
Synonyms:
CHEMBL1958322
Type:
Small organic molecule
Emp. Form.:
C21H29N3O2
Mol. Mass.:
355.4739
SMILES:
CC(C)n1ncc(cc1=O)-c1ccc(OCCCN2CCC[C@H]2C)cc1
: