Target
5-hydroxytryptamine receptor 3A
Ligand
BDBM50365256
Substrate
Meas. Tech.
ChEMBL_805902 (CHEMBL1960083)
Ki
16±n/a nM
Citation
 Tao, MAimone, LDHuang, ZMathiasen, JRaddatz, RLyons, JHudkins, RL Optimization of 5-pyridazin-3-one phenoxypropylamines as potent, selective histamine H3 receptor antagonists with potent cognition enhancing activity. J Med Chem 55:414-23 (2012)  
Target
Name:
5-hydroxytryptamine receptor 3A
Synonyms:
5-HT3 5HT3A_RAT Htr3 Serotonin (5-HT) receptor | Zacopride site-R
Type:
Enzyme Catalytic Domain
Mol. Mass.:
55428.70
Organism:
RAT
Description:
5-HT3 HTR3A RAT::P35563
Residue:
483
  
Inhibitor
Name:
BDBM50365256
Synonyms:
CHEMBL1958329
Type:
Small organic molecule
Emp. Form.:
C23H26N4O2
Mol. Mass.:
390.4781
SMILES:
O=c1cc(cnn1-c1ccccn1)-c1ccc(OCCCN2CCCCC2)cc1
: