Target
Thymidylate kinase
Ligand
BDBM50365391
Substrate
Meas. Tech.
ChEMBL_807088 (CHEMBL1959666)
IC50
>200000±n/a nM
Citation
 Choi, JYPlummer, MSStarr, JDesbonnet, CRSoutter, HChang, JMiller, JRDillman, KMiller, AARoush, WR Structure guided development of novel thymidine mimetics targeting Pseudomonas aeruginosa thymidylate kinase: from hit to lead generation. J Med Chem 55:852-70 (2012)  
Target
Name:
Thymidylate kinase
Synonyms:
CDC8 KTHY_HUMAN TYMK
Type:
PROTEIN
Mol. Mass.:
23824.09
Organism:
Homo sapiens (Human)
Description:
ChEMBL_946051
Residue:
212
  
Inhibitor
Name:
BDBM50365391
Synonyms:
CHEMBL1956642
Type:
Small organic molecule
Emp. Form.:
C14H12N4O2
Mol. Mass.:
268.2707
SMILES:
Cn1c2cc(cnc2[nH]c1=O)-c1cccc(c1)C(N)=O
: