Target
cAMP and cAMP-inhibited cGMP 3',5'-cyclic phosphodiesterase 10A
Ligand
BDBM31589
Substrate
Meas. Tech.
ChEMBL_807649 (CHEMBL1960211)
IC50
35±n/a nM
Citation
 Bauer, UGiordanetto, FBauer, MO'Mahony, GJohansson, KEKnecht, WHartleib-Geschwindner, JCarlsson, ETEnroth, C Discovery of 4-hydroxy-1,6-naphthyridine-3-carbonitrile derivatives as novel PDE10A inhibitors. Bioorg Med Chem Lett 22:1944-8 (2012)  
Target
Name:
cAMP and cAMP-inhibited cGMP 3',5'-cyclic phosphodiesterase 10A
Synonyms:
3',5'-cyclic phosphodiesterase PDE10A Phosphodiesterase 10 (PDE10) | Phosphodiesterase 10A
Type:
Protein
Mol. Mass.:
88412.52
Organism:
Homo sapiens (Human)
Description:
Q9Y233
Residue:
1055
  
Inhibitor
Name:
BDBM31589
Synonyms:
triaryl imidazole, 1
Type:
Small organic molecule
Emp. Form.:
C21H18N2O2S
Mol. Mass.:
362.445
SMILES:
COc1ccc(cc1)-c1nc([nH]c1-c1ccc(OC)cc1)-c1cccs1
: