Target
Phosphatidylinositol 3-kinase regulatory subunit alpha/4,5-bisphosphate 3-kinase catalytic subunit alpha isoform
Ligand
BDBM50365513
Substrate
Meas. Tech.
ChEMBL_807817 (CHEMBL1959595)
Ki
65±n/a nM
Citation
 Martínez González, SHernández, AIVarela, CRodríguez-Arístegui, SAlvarez, RMGarcía, ABLorenzo, MRivero, VOyarzabal, JRabal, OBischoff, JRAlbarrán, MCebriá, AAlfonso, PLink, WFominaya, JPastor, J Imidazo[1,2-a]pyrazines as novel PI3K inhibitors. Bioorg Med Chem Lett 22:1874-8 (2012)  
Target
Name:
Phosphatidylinositol 3-kinase regulatory subunit alpha/4,5-bisphosphate 3-kinase catalytic subunit alpha isoform
Synonyms:
PI3 Kinase alpha (p110 alpha/p85 alpha) PI3-kinase p110-alpha/p85-alpha subunit PI3K (p110alpha/p85alpha) PI3Kalpha Complex (Full Length p110alpha and p85alpha) Phosphoinositide 3-Kinase (PI3K) Chain B/ alpha Chain A Phosphoinositide 3-kinase alpha p110a / p85a p110alpha/p85alpha
Type:
Protein
Mol. Mass.:
Description:
Components:
This complex has 2 components.
Component 1
Name:
Phosphatidylinositol 4,5-bisphosphate 3-kinase catalytic subunit alpha isoform
Synonyms:
P42336 PI3-kinase subunit p110-alpha PIK3CA Phosphatidylinositol 3-kinase alpha (PI3Kalpha) Phosphatidylinositol 4,5-bisphosphate 3-kinase (PI3K) Phosphatidylinositol 4,5-bisphosphate 3-kinase catalytic subunit alpha (PI3Kalpha) Phosphatidylinositol 4,5-bisphosphate 3-kinase catalytic subunit alpha isoform (PI3-Ka) Phosphatidylinositol 4,5-bisphosphate 3-kinase catalytic subunit alpha isoform (PI3K p110alpha) Phosphatidylinositol 4,5-bisphosphate 3-kinase catalytic subunit alpha isoform (PI3K-alpha) Phosphatidylinositol 4,5-bisphosphate 3-kinase catalytic subunit alpha isoform (PI3Kalpha p110alpha) Phosphatidylinositol 4,5-bisphosphate 3-kinase catalytic subunit alpha isoform (PIK3CA) Phosphatidylinositol-4,5-bisphosphate 3-kinase catalytic subunit alpha isoform Phosphoinositide 3-Kinase (PI3K), alpha Chain A Phosphoinositide 3-kinases (PI3K) PtdIns-3-kinase p110 | p110 alpha
Type:
Enzyme Subunit
Mol. Mass.:
124294.87
Organism:
Homo sapiens (Human)
Description:
P42336
Residue:
1068
  
Component 2
Name:
Phosphatidylinositol 3-kinase regulatory subunit alpha
Synonyms:
GRB1 PI3-kinase class I PI3-kinase p85-alpha subunit PI3-kinase subunit p85-alpha PIK3CG/PIK3R1 Phosphatidylinositol 3-kinase 85 kDa regulatory subunit alpha (PI3K alpha) Phosphatidylinositol 3-kinase regulatory subunit alpha (PIK3R1) Phosphatidylinositol 3-kinase regulatory subunit alpha isoform 1 (PI3 Kinase alpha) Phosphatidylinositol 4,5-bisphosphate 3-kinase catalytic subunit alpha isoform (PI3Kalpha) PtdIns-3-kinase p85-alpha p85 alpha
Type:
Protein
Mol. Mass.:
83592.82
Organism:
Homo sapiens (Human)
Description:
P27986
Residue:
724
  
Inhibitor
Name:
BDBM50365513
Synonyms:
CHEMBL1957504
Type:
Small organic molecule
Emp. Form.:
C24H28N8O3
Mol. Mass.:
476.5309
SMILES:
O=C(NCCN1CCOCC1)c1cn2cc(nc(N3CCOCC3)c2n1)-c1cccc2[nH]ncc12
: