Target
5-hydroxytryptamine receptor 2C
Ligand
BDBM50365582
Substrate
Meas. Tech.
ChEMBL_808062 (CHEMBL1961170)
Ki
596±n/a nM
Citation
 Xiong, YUllman, BChoi, JSCherrier, MStrah-Pleynet, SDecaire, MFeichtinger, KFrazer, JMYoon, WHWhelan, KSanabria, EKGrottick, AJAl-Shamma, HSemple, G Identification of fused bicyclic heterocycles as potent and selective 5-HT(2A) receptor antagonists for the treatment of insomnia. Bioorg Med Chem Lett 22:1870-3 (2012)  
Target
Name:
5-hydroxytryptamine receptor 2C
Synonyms:
5-HT-2C 5-HT2C-INI 5-HTR2C 5-hydroxytryptamine receptor 2C (5-HT-2C) 5HT-1C HTR1C Serotonin (5-HT3) receptor Serotonin Receptor 2C
Type:
G Protein-Coupled Receptor (GPCR)
Mol. Mass.:
51836.79
Organism:
Homo sapiens (Human)
Description:
P28335
Residue:
458
  
Inhibitor
Name:
BDBM50365582
Synonyms:
CHEMBL1957810
Type:
Small organic molecule
Emp. Form.:
C20H20F2N4O
Mol. Mass.:
370.3958
SMILES:
Fc1ccc(CCN2CCN(CC2)C(=O)c2cn3ccccc3n2)c(F)c1
: