Target
5-hydroxytryptamine receptor 2A
Ligand
BDBM50365585
Substrate
Meas. Tech.
ChEMBL_808063 (CHEMBL1961171)
Ki
1.6±n/a nM
Citation
 Xiong, YUllman, BChoi, JSCherrier, MStrah-Pleynet, SDecaire, MFeichtinger, KFrazer, JMYoon, WHWhelan, KSanabria, EKGrottick, AJAl-Shamma, HSemple, G Identification of fused bicyclic heterocycles as potent and selective 5-HT(2A) receptor antagonists for the treatment of insomnia. Bioorg Med Chem Lett 22:1870-3 (2012)  
Target
Name:
5-hydroxytryptamine receptor 2A
Synonyms:
5-HT-2 5-HT2A 5-hydroxytryptamine receptor 2A (5HT-2A) 5HT2A_HUMAN HTR2A | Serotonin receptor 2A
Type:
undefined
Mol. Mass.:
52607.65
Organism:
Homo sapiens (Human)
Description:
P28223
Residue:
471
  
Inhibitor
Name:
BDBM50365585
Synonyms:
CHEMBL1957816
Type:
Small organic molecule
Emp. Form.:
C20H20F2N4O
Mol. Mass.:
370.3958
SMILES:
Fc1ccc(CCN2CCN(CC2)C(=O)c2cccn3ccnc23)c(F)c1
: