Target
Cell division cycle 7-related protein kinase/Protein DBF4 homolog A
Ligand
BDBM50365701
Substrate
Meas. Tech.
ChEMBL_808456 (CHEMBL1961032)
EC50
300±n/a nM
Citation
 Woods, KWLai, CMiyashiro, JMTong, YFlorjancic, ASHan, EKSoni, NShi, YLasko, LLeverson, JDJohnson, EFShoemaker, ARPenning, TD Aminopyrimidinone cdc7 kinase inhibitors. Bioorg Med Chem Lett 22:1940-3 (2012)  
Target
Name:
Cell division cycle 7-related protein kinase/Protein DBF4 homolog A
Synonyms:
Activator of S phase kinase DBF4/Cell division cycle 7-related protein kinase CDC7/DBF4 (Cell division cycle 7-related protein kinase/Activator of S phase kinase)
Type:
Protein
Mol. Mass.:
Description:
Components:
This complex has 2 components.
Component 1
Name:
Protein DBF4 homolog A
Synonyms:
ASK Chiffon homolog A DBF4-type zinc finger-containing protein 1 DBF4A_HUMAN ZDBF1
Type:
Regulatory subunit
Mol. Mass.:
76869.65
Organism:
Homo sapiens (Human)
Description:
Residue:
674
  
Component 2
Name:
Cell division cycle 7-related protein kinase
Synonyms:
CDC7 CDC7L1 Cell division cycle 7-related protein kinase (CDC7) huCdc7
Type:
Protein
Mol. Mass.:
63908.16
Organism:
Homo sapiens (Human)
Description:
O00311
Residue:
574
  
Inhibitor
Name:
BDBM50365701
Synonyms:
CHEMBL1958415
Type:
Small organic molecule
Emp. Form.:
C15H15N5O2
Mol. Mass.:
297.3119
SMILES:
O=c1cc(nc([nH]1)N1CCOCC1)-c1c[nH]c2ncccc12
: