Target
Prostaglandin G/H synthase 2
Ligand
BDBM50365757
Substrate
Meas. Tech.
ChEMBL_806010 (CHEMBL1960446)
IC50
62000±n/a nM
Citation
 Al-Hourani, BJSharma, SKSuresh, MWuest, F Novel 5-substituted 1H-tetrazoles as cyclooxygenase-2 (COX-2) inhibitors. Bioorg Med Chem Lett 22:2235-8 (2012)  
Target
Name:
Prostaglandin G/H synthase 2
Synonyms:
COX2 Cyclooxygenase 2 (COX-2) Cyclooxygenase-2 (COX-2 AA) Cyclooxygenase-2 (COX-2) PGH2_HUMAN PHS II Prostaglandin E synthase/G/H synthase 2 Prostaglandin-endoperoxide synthase 2
Type:
Enzyme
Mol. Mass.:
69003.89
Organism:
Homo sapiens (Human)
Description:
Recombinant Cox-2 provided by Cayman (Cayman Chemical Co.,Ann Arbor, MI).
Residue:
604
  
Inhibitor
Name:
BDBM50365757
Synonyms:
CHEMBL1956385
Type:
Small organic molecule
Emp. Form.:
C13H10ClN5O2S
Mol. Mass.:
335.769
SMILES:
NS(=O)(=O)c1ccc(cc1)-n1nnnc1-c1ccc(Cl)cc1
: