Target
E3 ubiquitin-protein ligase XIAP
Ligand
BDBM50365840
Substrate
Meas. Tech.
ChEMBL_806260 (CHEMBL1958906)
IC50
58±n/a nM
Citation
 Bianchi, AUgazzi, MFerrante, LLecis, DScavullo, CMastrangelo, ESeneci, P Rational design, synthesis and characterization of potent, drug-like monomeric Smac mimetics as pro-apoptotic anticancer agents. Bioorg Med Chem Lett 22:2204-8 (2012)  
Target
Name:
E3 ubiquitin-protein ligase XIAP
Synonyms:
API3 E3 ubiquitin-protein ligase XIAP Inhibitor of apoptosis protein 3 X-linked inhibitor of apoptosis XIAP | XIAP_HUMAN
Type:
Protein
Mol. Mass.:
56685.27
Organism:
Homo sapiens (Human)
Description:
P98170
Residue:
497
  
Inhibitor
Name:
BDBM50365840
Synonyms:
CHEMBL1957013
Type:
Small organic molecule
Emp. Form.:
C38H49N5O3
Mol. Mass.:
623.8274
SMILES:
CC[C@H](NC)C(=O)N[C@H]1[C@@H](CCNCc2ccccc2C)CC[C@H]2CC[C@H](N2C1=O)C(=O)NC(c1ccccc1)c1ccccc1
: