Target
cAMP and cAMP-inhibited cGMP 3',5'-cyclic phosphodiesterase 10A
Ligand
BDBM50365977
Substrate
Meas. Tech.
ChEMBL_807171 (CHEMBL1959835)
IC50
1.8±n/a nM
Citation
 Hu, EKunz, RKRumfelt, SChen, NBürli, RLi, CAndrews, KLZhang, JChmait, SKogan, JLindstrom, MHitchcock, SATreanor, J Discovery of potent, selective, and metabolically stable 4-(pyridin-3-yl)cinnolines as novel phosphodiesterase 10A (PDE10A) inhibitors. Bioorg Med Chem Lett 22:2262-5 (2012)  
Target
Name:
cAMP and cAMP-inhibited cGMP 3',5'-cyclic phosphodiesterase 10A
Synonyms:
3',5'-cyclic phosphodiesterase PDE10_HUMAN Phosphodiesterase 10A
Type:
Protein
Mol. Mass.:
88412.52
Organism:
Homo sapiens (Human)
Description:
Q9Y233
Residue:
779
  
Inhibitor
Name:
BDBM50365977
Synonyms:
CHEMBL1956248
Type:
Small organic molecule
Emp. Form.:
C24H28N4O3
Mol. Mass.:
420.5041
SMILES:
COc1cc2nncc(-c3cnc(N4CCC(O)(CC4)C4CC4)c(C)c3)c2cc1OC
: