Target
Carbonic anhydrase 3
Ligand
BDBM50366036
Substrate
Meas. Tech.
ChEMBL_807337 (CHEMBL1960517)
Ki
710±n/a nM
Citation
 Carta, FVullo, DMaresca, AScozzafava, ASupuran, CT New chemotypes acting as isozyme-selective carbonic anhydrase inhibitors with low affinity for the offtarget cytosolic isoform II. Bioorg Med Chem Lett 22:2182-5 (2012)  
Target
Name:
Carbonic anhydrase 3
Synonyms:
CA-III CAH3_HUMAN Carbonic Anhydrase III Carbonic anhydrase 3 (CA III) | Carbonic anhydrase III (CA III)
Type:
Enzyme
Mol. Mass.:
29562.11
Organism:
Homo sapiens (Human)
Description:
Human cloned isozyme.
Residue:
260
  
Inhibitor
Name:
BDBM50366036
Synonyms:
CHEMBL1956578
Type:
Small organic molecule
Emp. Form.:
C7H9NO2
Mol. Mass.:
139.1519
SMILES:
Cc1cc(C)o\c(c1)=N\O
: