Target
Carbonic anhydrase 2
Ligand
BDBM50366098
Substrate
Meas. Tech.
ChEMBL_808111 (CHEMBL1961262)
Ki
>200000±n/a nM
Citation
 Carta, FMaresca, AScozzafava, ASupuran, CT Novel coumarins and 2-thioxo-coumarins as inhibitors of the tumor-associated carbonic anhydrases IX and XII. Bioorg Med Chem 20:2266-73 (2012)  
Target
Name:
Carbonic anhydrase 2
Synonyms:
CA-II CAC Carbonate dehydratase II Carbonic anhydrase 2 (CA-II) Carbonic anhydrase C Carbonic anhydrase II (CA-II) Carbonic anhydrase II (hCA II) | Carbonic anhydrase isoenzyme II (hCA II)
Type:
Enzyme
Mol. Mass.:
29250.71
Organism:
Homo sapiens (Human)
Description:
P00918
Residue:
260
  
Inhibitor
Name:
BDBM50366098
Synonyms:
CHEMBL1957177
Type:
Small organic molecule
Emp. Form.:
C9H6O2S
Mol. Mass.:
178.208
SMILES:
Oc1ccc2oc(=S)ccc2c1
: