Target
Epidermal growth factor receptor
Ligand
BDBM4078
Substrate
Meas. Tech.
ChEMBL_808129 (CHEMBL1961280)
IC50
690±n/a nM
Citation
 Hundsdörfer, CHemmerling, HJGötz, CTotzke, FBednarski, PLe Borgne, MJose, J Indeno[1,2-b]indole derivatives as a novel class of potent human protein kinase CK2 inhibitors. Bioorg Med Chem 20:2282-9 (2012)  
Target
Name:
Epidermal growth factor receptor
Synonyms:
EGF Receptor Substrate EGFR_HUMAN ERBB1 Epidermal Growth Factor Receptor erbB-1 Epidermal growth factor receptor (EGFR) HER1 Proto-oncogene c-ErbB-1 Tyrosine-Protein Kinase ErbB-1
Type:
Receptor Kinase Domain
Mol. Mass.:
134279.59
Organism:
Homo sapiens (Human)
Description:
P00533
Residue:
1210
  
Inhibitor
Name:
BDBM4078
Synonyms:
6,7,13,14-tetrahydroxy-2,9-dioxatetracyclo[6.6.2.0^{4,16}.0^{11,15}]hexadeca-1(14),4(16),5,7,11(15),12-hexaene-3,10-dione ELLAGIC ACID Ellagic acid (18) MLS000069632 cid_5281855
Type:
Small organic molecule
Emp. Form.:
C14H6O8
Mol. Mass.:
302.1926
SMILES:
Oc1cc2c3c(oc(=O)c4cc(O)c(O)c(oc2=O)c34)c1O
: