Target
Insulin-like growth factor 1 receptor
Ligand
BDBM4078
Substrate
Meas. Tech.
ChEMBL_808133 (CHEMBL1961284)
IC50
250±n/a nM
Citation
 Hundsdörfer, CHemmerling, HJGötz, CTotzke, FBednarski, PLe Borgne, MJose, J Indeno[1,2-b]indole derivatives as a novel class of potent human protein kinase CK2 inhibitors. Bioorg Med Chem 20:2282-9 (2012)  
Target
Name:
Insulin-like growth factor 1 receptor
Synonyms:
CD_antigen=CD221 IGF1R Insulin-like growth factor 1 receptor (IGF1R) Insulin-like growth factor 1 receptor alpha chain Insulin-like growth factor I receptor | Insulin-like growth factor receptor (IGFR)
Type:
Protein
Mol. Mass.:
154776.79
Organism:
Homo sapiens (Human)
Description:
P08069
Residue:
1367
  
Inhibitor
Name:
BDBM4078
Synonyms:
6,7,13,14-tetrahydroxy-2,9-dioxatetracyclo[6.6.2.0^{4,16}.0^{11,15}]hexadeca-1(14),4(16),5,7,11(15),12-hexaene-3,10-dione ELLAGIC ACID Ellagic acid (18) MLS000069632 cid_5281855
Type:
Small organic molecule
Emp. Form.:
C14H6O8
Mol. Mass.:
302.1926
SMILES:
Oc1cc2c3c(oc(=O)c4cc(O)c(O)c(oc2=O)c34)c1O
: