Target
Vascular endothelial growth factor receptor 3
Ligand
BDBM4078
Substrate
Meas. Tech.
ChEMBL_808260 (CHEMBL1961230)
IC50
1540±n/a nM
Citation
 Hundsdörfer, CHemmerling, HJGötz, CTotzke, FBednarski, PLe Borgne, MJose, J Indeno[1,2-b]indole derivatives as a novel class of potent human protein kinase CK2 inhibitors. Bioorg Med Chem 20:2282-9 (2012)  
Target
Name:
Vascular endothelial growth factor receptor 3
Synonyms:
FLT-4 Fms-like tyrosine kinase 4 VEGFR-3 VGFR3_HUMAN Vascular endothelial growth factor receptor 3 (VEGFR-3) | Vascular endothelial growth factor receptor 3 (VEGFR3)
Type:
Protein
Mol. Mass.:
152749.58
Organism:
Homo sapiens (Human)
Description:
P35916-2
Residue:
1363
  
Inhibitor
Name:
BDBM4078
Synonyms:
6,7,13,14-tetrahydroxy-2,9-dioxatetracyclo[6.6.2.0^{4,16}.0^{11,15}]hexadeca-1(14),4(16),5,7,11(15),12-hexaene-3,10-dione ELLAGIC ACID Ellagic acid (18) MLS000069632 cid_5281855
Type:
Small organic molecule
Emp. Form.:
C14H6O8
Mol. Mass.:
302.1926
SMILES:
Oc1cc2c3c(oc(=O)c4cc(O)c(O)c(oc2=O)c34)c1O
: