Target
Prostaglandin E2 receptor EP3 subtype
Ligand
BDBM50366143
Substrate
Meas. Tech.
ChEMBL_808315 (CHEMBL1961332)
Ki
570±n/a nM
Citation
 Kambe, TMaruyama, TNakai, YYoshida, HOida, HMaruyama, TAbe, NNishiura, ANakai, HToda, M Discovery of novel prostaglandin analogs as potent and selective EP2/EP4 dual agonists. Bioorg Med Chem 20:2235-51 (2012)  
Target
Name:
Prostaglandin E2 receptor EP3 subtype
Synonyms:
PE2R3_MOUSE Prostaglandin E2 receptor EP3 isoform alpha Prostanoid EP3 receptor Ptgerep3
Type:
G-protein coupled receptor
Mol. Mass.:
40092.50
Organism:
Mus musculus (Mouse)
Description:
Residue:
365
  
Inhibitor
Name:
BDBM50366143
Synonyms:
CHEMBL1957430
Type:
Small organic molecule
Emp. Form.:
C22H25NO4S2
Mol. Mass.:
431.568
SMILES:
Cc1cccc(C[C@H](O)\C=C\[C@H]2CCC(=O)N2CCSc2ccc(s2)C(O)=O)c1
: