Target
Prostaglandin E2 receptor EP1 subtype
Ligand
BDBM50360622
Substrate
Meas. Tech.
ChEMBL_808313 (CHEMBL1961330)
Ki
>10000±n/a nM
Citation
 Kambe, TMaruyama, TNakai, YYoshida, HOida, HMaruyama, TAbe, NNishiura, ANakai, HToda, M Discovery of novel prostaglandin analogs as potent and selective EP2/EP4 dual agonists. Bioorg Med Chem 20:2235-51 (2012)  
Target
Name:
Prostaglandin E2 receptor EP1 subtype
Synonyms:
PE2R1_MOUSE Prostaglandin E1 Prostanoid EP1 receptor Ptgerep1
Type:
G-protein coupled receptor
Mol. Mass.:
43000.62
Organism:
Mus musculus (Mouse)
Description:
Residue:
405
  
Inhibitor
Name:
BDBM50360622
Synonyms:
CHEMBL1933718
Type:
Small organic molecule
Emp. Form.:
C24H27NO4
Mol. Mass.:
393.4755
SMILES:
Cc1cccc(C[C@H](O)\C=C\[C@H]2CCC(=O)N2CCc2ccc(cc2)C(O)=O)c1
: