Target
Carbonic anhydrase 2
Ligand
BDBM10877
Substrate
Meas. Tech.
ChEMBL_805626 (CHEMBL1960460)
Ki
125±n/a nM
Citation
 Turkoglu, SMaresca, AAlper, MKockar, FIsik, SSinan, SOzensoy, OArslan, OSupuran, CT Mutation of active site residues Asn67 to Ile, Gln92 to Val and Leu204 to Ser in human carbonic anhydrase II: influences on the catalytic activity and affinity for inhibitors. Bioorg Med Chem 20:2208-13 (2012)  
Target
Name:
Carbonic anhydrase 2
Synonyms:
CA-II CAC Carbonate dehydratase II Carbonic anhydrase 2 (CA-II) Carbonic anhydrase C Carbonic anhydrase II (CA-II) Carbonic anhydrase II (hCA II) | Carbonic anhydrase isoenzyme II (hCA II)
Type:
Enzyme
Mol. Mass.:
29250.71
Organism:
Homo sapiens (Human)
Description:
P00918
Residue:
260
  
Inhibitor
Name:
BDBM10877
Synonyms:
4-(2-hydroxyethyl)benzene-1-sulfonamide JMC522226 Compound 21 aromatic/heteroaromatic sulfonamide 22
Type:
Small organic molecule
Emp. Form.:
C8H11NO3S
Mol. Mass.:
201.243
SMILES:
NS(=O)(=O)c1ccc(CCO)cc1
: