Target
Leukotriene A-4 hydrolase
Ligand
BDBM50279808
Substrate
Meas. Tech.
ChEMBL_96945 (CHEMBL706185)
Ki
50000±n/a nM
Citation
 Yuan, WZhong, ZWong, CHaeggstrom, JZWetterholm, ASamuelsson, B Probing the inhibition of leukotriene A4 hydrolase based on its aminopeptidase activity Bioorg Med Chem Lett 1:551-556 (1991)    Article 
Target
Name:
Leukotriene A-4 hydrolase
Synonyms:
LKHA4_HUMAN LTA4 Leukotriene A(4) hydrolase Leukotriene A4 hydrolase
Type:
Hydrolase; metalloprotease
Mol. Mass.:
69280.41
Organism:
Homo sapiens (Human)
Description:
Human recombinant LTA4H.
Residue:
611
  
Inhibitor
Name:
BDBM50279808
Synonyms:
(2S,3S)-3-Amino-2-hydroxy-4-phenyl-butyric acid methyl ester CHEMBL68387
Type:
Small organic molecule
Emp. Form.:
C11H15NO3
Mol. Mass.:
209.2417
SMILES:
COC(=O)[C@@H](O)[C@@H](N)Cc1ccccc1
: