Target
Beta-galactosidase
Ligand
BDBM50279835
Substrate
Meas. Tech.
ChEMBL_37137 (CHEMBL650371)
Ki
51000000±n/a nM
Citation
 Field, RAHaines, AHChrystal, EJ The Interaction of Anhydroalditols with Sweet-Almond -glucosidase and Escherichia coli -galactosidase: implications for the design of potent glycosidase inhibitors Bioorg Med Chem Lett 1:667-672 (1991)    Article 
Target
Name:
Beta-galactosidase
Synonyms:
BGAL_ECOLX Lactase | lacZ
Type:
PROTEIN
Mol. Mass.:
116943.87
Organism:
Escherichia coli
Description:
ChEMBL_215882
Residue:
1029
  
Inhibitor
Name:
BDBM50279835
Synonyms:
(2R,3S,4R)-2-Hydroxymethyl-tetrahydro-furan-3,4-diol | CHEMBL161686
Type:
Small organic molecule
Emp. Form.:
C5H10O4
Mol. Mass.:
134.1305
SMILES:
OC[C@H]1OC[C@@H](O)[C@@H]1O
: