Target
Beta-glucosidase
Ligand
BDBM18351
Substrate
Meas. Tech.
ChEMBL_37573 (CHEMBL647654)
Ki
9500±n/a nM
Citation
 Field, RAHaines, AHChrystal, EJ The Interaction of Anhydroalditols with Sweet-Almond -glucosidase and Escherichia coli -galactosidase: implications for the design of potent glycosidase inhibitors Bioorg Med Chem Lett 1:667-672 (1991)    Article 
Target
Name:
Beta-glucosidase
Synonyms:
Type:
PROTEIN
Mol. Mass.:
60428.49
Organism:
Prunus avium
Description:
ChEMBL_37428
Residue:
531
  
Inhibitor
Name:
BDBM18351
Synonyms:
(2R,3R,4R,5S)-2-(Hydroxymethyl)piperidine-3,4,5-triol, 10 1-Deoxynojirimycin CHEMBL307429 US9181184, 1 | dNM
Type:
natural product
Emp. Form.:
C6H13NO4
Mol. Mass.:
163.1717
SMILES:
OC[C@H]1NC[C@H](O)[C@@H](O)[C@@H]1O
: