Target
5-hydroxytryptamine receptor 4
Ligand
BDBM50155152
Substrate
Meas. Tech.
ChEMBL_3325 (CHEMBL619025)
EC50
538±n/a nM
Citation
 Flynn, DLBecker, DPSpangler, DPNosal, RGullikson, GWMoummi, CYang, D New aza(nor)adamantanes are agonists at the newly identified serotonin 5-HT4 receptor and antagonists at the 5-HT3 receptor Bioorg Med Chem Lett 2:1613-1618 (1992)    Article 
Target
Name:
5-hydroxytryptamine receptor 4
Synonyms:
5-HT-4 5-HT4L 5-hydroxytryptamine receptor 4 Htr4 Serotonin 4 (5-HT4) receptor
Type:
Enzyme Catalytic Domain
Mol. Mass.:
46117.31
Organism:
RAT
Description:
5-HT4 HTR4 RAT::Q62758
Residue:
406
  
Inhibitor
Name:
BDBM50155152
Synonyms:
4-Amino-N-(1-aza-tricyclo[3.3.1.1*3,7*]dec-4-yl)-5-chloro-2-methoxy-benzamide CHEMBL295155 | SC-51718
Type:
Small organic molecule
Emp. Form.:
C17H22ClN3O2
Mol. Mass.:
335.828
SMILES:
COc1cc(N)c(Cl)cc1C(=O)NC1C2CC3CC1CN(C3)C2
: