Target
Purine nucleoside phosphorylase
Ligand
BDBM50280446
Substrate
Meas. Tech.
ChEMBL_162026 (CHEMBL770307)
Ki
4±n/a nM
Citation
 Halazy, SEggenspiller, AEhrhard, ADanzin, C Phosphonate derivatives of N9-benzylguanine: a new class of potent purine nucleoside phosphorylase inhibitors Bioorg Med Chem Lett 2:407-410 (1992)    Article 
Target
Name:
Purine nucleoside phosphorylase
Synonyms:
Inosine phosphorylase PNP Purine Nucleoside Phosphorylase (PNP) | Purine nucleoside phosphorylase
Type:
Enzyme
Mol. Mass.:
32035.18
Organism:
Bos taurus (bovine)
Description:
Residue:
289
  
Inhibitor
Name:
BDBM50280446
Synonyms:
2-{2-[(2-amino-6-oxo-1,6-dihydro-9H-purin-9-yl)methyl]phenyl}-1,1-difluoroethylphosphonate
Type:
Small organic molecule
Emp. Form.:
C14H12F2N5O4P
Mol. Mass.:
383.2478
SMILES:
Nc1nc2n(Cc3ccccc3CC(F)(F)P([O-])([O-])=O)cnc2c(=O)[nH]1
: