Target
Leukotriene B4 receptor 1
Ligand
BDBM50013889
Substrate
Meas. Tech.
ChEMBL_98512 (CHEMBL706534)
IC50
1.9±n/a nM
Citation
 Scott Sawyer, JBaldwin, RFFroelich, LLSaussy, DLJackson, WT Synthesis and pharmacologic activity of hydroxyacetophenone-substituted benzophenone/xanthone leukotriene B4 receptor antagonists Bioorg Med Chem Lett 3:1981-1984 (1993)    Article 
Target
Name:
Leukotriene B4 receptor 1
Synonyms:
BLT BLTR Chemoattractant receptor-like 1 GPR16 LTB4-R 1 Leukotriene B4 R1 Leukotriene B4 receptor 1 P2Y purinoceptor 7 | P2Y7
Type:
Enzyme Catalytic Domain
Mol. Mass.:
37582.68
Organism:
Homo sapiens (Human)
Description:
Q15722
Residue:
352
  
Inhibitor
Name:
BDBM50013889
Synonyms:
(5S,6Z,8E,10E,12R,14Z)-5,12-dihydroxyicosa-6,8,10,14-tetraenoic acid 5,12-Dihete 5S,12R-dihydroxy-6Z,8E,10E,14Z-eicosatetraenoic acid DIHETE 12(s), 5(s) leukotriene B4
Type:
Small organic molecule
Emp. Form.:
C20H32O4
Mol. Mass.:
336.4657
SMILES:
CCCCC\C=C/C[C@@H](O)\C=C\C=C\C=C/[C@@H](O)CCCC(O)=O
: