Target
Neurotensin receptor type 1
Ligand
BDBM50366310
Substrate
Meas. Tech.
ChEBML_144304
Ki
680±n/a nM
Citation
 Cain, GAChristos, TEJohnson, ALPottorf, RSConfalone, PNWilliam Tam, SSchmidt, WK Neurotensin receptor binding and antinociceptive activity for lipophilic N-amido neurotensin(913) analogs Bioorg Med Chem Lett 3:2055-2060 (1993)    Article 
Target
Name:
Neurotensin receptor type 1
Synonyms:
NTR1_RAT Ntsr | Ntsr1
Type:
PROTEIN
Mol. Mass.:
47070.64
Organism:
Rattus norvegicus
Description:
ChEMBL_1466612
Residue:
424
  
Inhibitor
Name:
BDBM50366310
Synonyms:
CHEMBL1790461
Type:
Small organic molecule
Emp. Form.:
C38H62N6O8
Mol. Mass.:
730.9343
SMILES:
CC[C@@H](C)[C@H](NC(=O)[C@H](Cc1ccc(O)cc1)NC(=O)[C@@H]1CCCN1C(=O)[C@H](CCCCN)NC(=O)CC(C)(C)C)C(=O)N[C@@H](CC(C)C)C(O)=O
: