Target
S-adenosylmethionine decarboxylase proenzyme
Ligand
BDBM50366318
Substrate
Meas. Tech.
ChEBML_197377
Ki
415000±n/a nM
Citation
 Guo, JQWu, YQFarmer, WLDouglas, KAWoster, PMGarofalo, JBasshi, CJ Restricted rotation analogs of S-adenosylmethionine: synthesis, evaluation as inhibitors of S-adenosylmethionine decarboxylase, and potential use as selective antitrypanosomal agents Bioorg Med Chem Lett 3:147-152 (1993)    Article 
Target
Name:
S-adenosylmethionine decarboxylase proenzyme
Synonyms:
AMD DCAM_HUMAN S-adenosylmethionine decarboxylase 1 | SAMDC
Type:
Heterotetramer of two alpha and two beta chains
Mol. Mass.:
38337.21
Organism:
Homo sapiens (Human)
Description:
For the production of protein for the hAdoMetDC enzyme assays, the plasmid containing (H)6 tag at the carboxyl end (replacing -QQQQQS) was used.
Residue:
334
  
Inhibitor
Name:
BDBM50366318
Synonyms:
CHEMBL3392208 | CHEMBL605698
Type:
Small organic molecule
Emp. Form.:
C14H22N6O7S2
Mol. Mass.:
450.49
SMILES:
OS(O)(=O)=O.Nc1ncnc2n(cnc12)[C@@H]1O[C@H](CSC2CCNC2)[C@@H](O)[C@H]1O
: