Target
Phospholipase A2
Ligand
BDBM50281623
Substrate
Meas. Tech.
ChEBML_156506
IC50
2400±n/a nM
Citation
 Wilkerson, WDeLucca, IGalbraith, WHarris, RKerr, J Antiinflammatory -benzeneethanamines. III Bioorg Med Chem Lett 3:711-716 (1993)    Article 
Target
Name:
Phospholipase A2
Synonyms:
PA21B_RAT Pla2g1b
Type:
PROTEIN
Mol. Mass.:
16427.59
Organism:
Rattus norvegicus
Description:
ChEMBL_156506
Residue:
146
  
Inhibitor
Name:
BDBM50281623
Synonyms:
2-(4-fluorophenyl)-6-(2-naphthylsulfanyl)-1-hexanamine; with Hydrochloric acid | CHEMBL542998
Type:
Small organic molecule
Emp. Form.:
C22H24FNS
Mol. Mass.:
353.496
SMILES:
NCC(CCCCSc1ccc2ccccc2c1)c1ccc(F)cc1
: