Target
Phospholipase A2
Ligand
BDBM50281625
Substrate
Meas. Tech.
ChEBML_156506
IC50
6600±n/a nM
Citation
 Wilkerson, WDeLucca, IGalbraith, WHarris, RKerr, J Antiinflammatory -benzeneethanamines. III Bioorg Med Chem Lett 3:711-716 (1993)    Article 
Target
Name:
Phospholipase A2
Synonyms:
PA21B_RAT Pla2g1b
Type:
PROTEIN
Mol. Mass.:
16427.59
Organism:
Rattus norvegicus
Description:
ChEMBL_156506
Residue:
146
  
Inhibitor
Name:
BDBM50281625
Synonyms:
2-(4-fluorophenyl)-7-(4-methylphenylsulfanyl)-1-heptanamine; with Hydrochloric acid | CHEMBL536933
Type:
Small organic molecule
Emp. Form.:
C20H26FNS
Mol. Mass.:
331.491
SMILES:
Cc1ccc(SCCCCCC(CN)c2ccc(F)cc2)cc1
: