Target
Type-1 angiotensin II receptor B
Ligand
BDBM50449917
Substrate
Meas. Tech.
ChEMBL_34833 (CHEMBL648767)
Ki
0.800000±n/a nM
Citation
 Poss, MAGu, ZRyono, DEReid, JASieber-McMaster, ESpitzmiller, ERDejneka, TDickinson, KEWilliams, SBMoreland, SDelaney, CLBird, JWaldron, TLSchaeffer, TRHedberg, SPetrillo, EW 1,4-substituted indoles: a potent and selective class of angiostensin II receptor antagonists Bioorg Med Chem Lett 4:145-150 (1994)    Article 
Target
Name:
Type-1 angiotensin II receptor B
Synonyms:
AGTRB_RAT Agtr1 Angiotensin II AT1B Angiotensin II type 1b (AT-1b) receptor Type-1B angiotensin II receptor
Type:
Enzyme Catalytic Domain
Mol. Mass.:
40929.44
Organism:
RAT
Description:
Angiotensin II AT1B 0 RAT::P29089
Residue:
359
  
Inhibitor
Name:
BDBM50449917
Synonyms:
BMS-180560 | CHEMBL2021417
Type:
Small organic molecule
Emp. Form.:
C24H22ClLi2N7O3
Mol. Mass.:
505.812
SMILES:
[Li+].[Li]O.CCCCc1nc(Cl)c(C([O-])=O)n1Cc1cccc2n(ccc12)-c1ccccc1-c1nn[nH]n1
: