Target
Amine oxidase [flavin-containing] B
Ligand
BDBM50282510
Substrate
Meas. Tech.
ChEMBL_123929 (CHEMBL729463)
IC50
0.6±n/a nM
Citation
 Rendenbach-Muller, BSchlecker, RTraut, MWeifenbach, H Synthesis of coumarins as subtype-selective inhibitors of monoamine oxidase Bioorg Med Chem Lett 4:1195-1198 (1994)    Article 
Target
Name:
Amine oxidase [flavin-containing] B
Synonyms:
AOFB_RAT Amine oxidase [flavin-containing] B Monoamine Oxidase Type B (MAO-B) Monoamine oxidase B (MAO-B) Monoamine oxidase type B (MAOB) | Monoamine oxidase-B (MAO-B)
Type:
Enzyme
Mol. Mass.:
58469.65
Organism:
Rattus norvegicus (rat)
Description:
P19643
Residue:
520
  
Inhibitor
Name:
BDBM50282510
Synonyms:
7-(4-Chloro-benzyloxy)-3,4-dimethyl-chromen-2-one CHEMBL274030
Type:
Small organic molecule
Emp. Form.:
C18H15ClO3
Mol. Mass.:
314.763
SMILES:
Cc1c(C)c(=O)oc2cc(OCc3ccc(Cl)cc3)ccc12
: