Target
Amine oxidase [flavin-containing] B
Ligand
BDBM50240393
Substrate
Meas. Tech.
ChEMBL_123929 (CHEMBL729463)
IC50
0.5±n/a nM
Citation
 Rendenbach-Muller, BSchlecker, RTraut, MWeifenbach, H Synthesis of coumarins as subtype-selective inhibitors of monoamine oxidase Bioorg Med Chem Lett 4:1195-1198 (1994)    Article 
Target
Name:
Amine oxidase [flavin-containing] B
Synonyms:
AOFB_RAT Amine oxidase [flavin-containing] B Monoamine Oxidase Type B (MAO-B) Monoamine oxidase B (MAO-B) Monoamine oxidase type B (MAOB) | Monoamine oxidase-B (MAO-B)
Type:
Enzyme
Mol. Mass.:
58469.65
Organism:
Rattus norvegicus (rat)
Description:
P19643
Residue:
520
  
Inhibitor
Name:
BDBM50240393
Synonyms:
3,4-dimethyl-7-methoxycoumarin CHEMBL274029
Type:
Small organic molecule
Emp. Form.:
C12H12O3
Mol. Mass.:
204.2219
SMILES:
COc1ccc2c(C)c(C)c(=O)oc2c1
: