Target
Aminopeptidase B
Ligand
BDBM50282711
Substrate
Meas. Tech.
ChEMBL_35336 (CHEMBL645443)
IC50
1000000±n/a nM
Citation
 Luisa Sua rez-Gea, MGarci a-Lo pez, TPe rez, CHerranz, R Pseudopeptide inhibitors of aminopeptidases containing the [CH(CN)NH] surrogate as a transition-state MIMIC Bioorg Med Chem Lett 4:1491-1496 (1994)    Article 
Target
Name:
Aminopeptidase B
Synonyms:
AMPB_MOUSE Arginine aminopeptidase Cytosol aminopeptidase IV | Rnpep
Type:
PROTEIN
Mol. Mass.:
72401.87
Organism:
Mus musculus
Description:
ChEMBL_35337
Residue:
650
  
Inhibitor
Name:
BDBM50282711
Synonyms:
1-[(S)-2-((1R,2S)-2-tert-Butoxycarbonylamino-1-cyano-3-phenyl-propylamino)-4-methyl-pentanoyl]-pyrrolidine-2-carboxylic acid methyl ester | CHEMBL289761
Type:
Small organic molecule
Emp. Form.:
C27H40N4O5
Mol. Mass.:
500.6303
SMILES:
COC(=O)C1CCCN1C(=O)[C@H](CC(C)C)N[C@H](C#N)[C@H](Cc1ccccc1)NC(=O)OC(C)(C)C
: