Target
Aminopeptidase B
Ligand
BDBM50282714
Substrate
Meas. Tech.
ChEMBL_35336 (CHEMBL645443)
IC50
1000000±n/a nM
Citation
 Luisa Sua rez-Gea, MGarci a-Lo pez, TPe rez, CHerranz, R Pseudopeptide inhibitors of aminopeptidases containing the [CH(CN)NH] surrogate as a transition-state MIMIC Bioorg Med Chem Lett 4:1491-1496 (1994)    Article 
Target
Name:
Aminopeptidase B
Synonyms:
AMPB_MOUSE Arginine aminopeptidase Cytosol aminopeptidase IV | Rnpep
Type:
PROTEIN
Mol. Mass.:
72401.87
Organism:
Mus musculus
Description:
ChEMBL_35337
Residue:
650
  
Inhibitor
Name:
BDBM50282714
Synonyms:
1-[(S)-2-((1R,2S)-2-Amino-1-carbamoyl-3-phenyl-propylamino)-4-methyl-pentanoyl]-pyrrolidine-2-carboxylic acid methyl ester | CHEMBL287539
Type:
Small organic molecule
Emp. Form.:
C22H34N4O4
Mol. Mass.:
418.5298
SMILES:
COC(=O)C1CCCN1C(=O)[C@H](CC(C)C)N[C@@H]([C@@H](N)Cc1ccccc1)C(N)=O
: