Target
3-phosphoshikimate 1-carboxyvinyltransferase
Ligand
BDBM50283572
Substrate
Meas. Tech.
ChEMBL_64948 (CHEMBL675693)
IC50
10000000±n/a nM
Citation
 Miller, MJBraccolino, DSClearly, DGReam, JEWalker, MCSikorski, JA EPSP synthase inhibitor design IV. New aromatic substrate analogs and symmetrical inhibitors containing novel 3-phosphate mimics. Bioorg Med Chem Lett 4:2605-2608 (1994)    Article 
Target
Name:
3-phosphoshikimate 1-carboxyvinyltransferase
Synonyms:
5-enolpyruvylshikimate-3-phosphate synthase aroA
Type:
PROTEIN
Mol. Mass.:
46089.22
Organism:
Escherichia coli (strain K12)
Description:
ChEMBL_65087
Residue:
427
  
Inhibitor
Name:
BDBM50283572
Synonyms:
CHEMBL262641 | Sodium; (3-carboxy-5-phosphonomethyl-phenoxy)-acetate
Type:
Small organic molecule
Emp. Form.:
C10H8O8P
Mol. Mass.:
287.1411
SMILES:
OP([O-])(=O)Cc1cc(OCC([O-])=O)cc(c1)C([O-])=O
: