Target
Lysosomal alpha-glucosidase
Ligand
BDBM50283598
Substrate
Meas. Tech.
ChEMBL_34262 (CHEMBL647606)
IC50
1340±n/a nM
Citation
 Uchida, CKimura, HOgawa, S Potent glycosidase inhibitors, N-phenyl cyclic isourea derivatives of 5-amino- and 5-amino-1-C-(hydroxymethyl)-cyclopentane-1,2,3,4-tetraols Bioorg Med Chem Lett 4:2643-2648 (1994)    Article 
Target
Name:
Lysosomal alpha-glucosidase
Synonyms:
70 kDa lysosomal alpha-glucosidase Acid maltase Alpha glucosidase LYAG_HUMAN
Type:
PROTEIN
Mol. Mass.:
105312.45
Organism:
Homo sapiens (Human)
Description:
ChEMBL_1506060
Residue:
952
  
Inhibitor
Name:
BDBM50283598
Synonyms:
5-Amino-1-hydroxymethyl-cyclopentane-1,2,3,4-tetraol | CHEMBL88413
Type:
Small organic molecule
Emp. Form.:
C6H13NO5
Mol. Mass.:
179.1711
SMILES:
NC1C(O)C(O)C(O)C1(O)CO
: