Target
Lysosomal alpha-glucosidase
Ligand
BDBM18351
Substrate
Meas. Tech.
ChEBML_215887
IC50
>300000±n/a nM
Citation
 Uchida, CKimura, HOgawa, S Potent glycosidase inhibitors, N-phenyl cyclic isourea derivatives of 5-amino- and 5-amino-1-C-(hydroxymethyl)-cyclopentane-1,2,3,4-tetraols Bioorg Med Chem Lett 4:2643-2648 (1994)    Article 
Target
Name:
Lysosomal alpha-glucosidase
Synonyms:
Alpha-glucosidase LYAG_BOVIN
Type:
PROTEIN
Mol. Mass.:
104738.88
Organism:
Bos taurus
Description:
ChEMBL_215887
Residue:
937
  
Inhibitor
Name:
BDBM18351
Synonyms:
(2R,3R,4R,5S)-2-(Hydroxymethyl)piperidine-3,4,5-triol, 10 1-Deoxynojirimycin CHEMBL307429 US9181184, 1 | dNM
Type:
natural product
Emp. Form.:
C6H13NO4
Mol. Mass.:
163.1717
SMILES:
OC[C@H]1NC[C@H](O)[C@@H](O)[C@@H]1O
: