Target
Neprilysin
Ligand
BDBM50283607
Substrate
Meas. Tech.
ChEMBL_144624 (CHEMBL752983)
Ki
26±n/a nM
Citation
 Bhagwat, SSFink, CAGude, CChan, KQiao, YSakane, YBerry, CGhai, RD 4-Substituted proline derivatives that inhibit angiotensin converting enzyme and neutral endopeptidase 24.11. Bioorg Med Chem Lett 4:2673-2676 (1994)    Article 
Target
Name:
Neprilysin
Synonyms:
Mme Neprilysin Neutral endopeptidase 24.11
Type:
Protein
Mol. Mass.:
85789.59
Organism:
Rattus norvegicus (Rat)
Description:
P07861
Residue:
750
  
Inhibitor
Name:
BDBM50283607
Synonyms:
7-(2-Mercaptomethyl-3-phenyl-propionylamino)-heptanoic acid | CHEMBL328519
Type:
Small organic molecule
Emp. Form.:
C17H25NO3S
Mol. Mass.:
323.45
SMILES:
OC(=O)CCCCCCNC(=O)C(CS)Cc1ccccc1
: