Target
Mu-type opioid receptor
Ligand
BDBM50366357
Substrate
Meas. Tech.
ChEBML_138891
Ki
>100±n/a nM
Citation
 Gottschlich, RAckermann, KBarber, ABartoszyk, GGreiner, H EMD 61 753 as a favourable representative of structurally novel arylacetamido-type K opiate receptor agonists Bioorg Med Chem Lett 4:677-682 (1994)    Article 
Target
Name:
Mu-type opioid receptor
Synonyms:
MOR-1 Mu-type opioid receptor (MOR) OPRM_RAT Opioid receptor B Ror-b
Type:
G Protein-Coupled Receptor (GPCR)
Mol. Mass.:
44503.11
Organism:
Rattus norvegicus (rat)
Description:
Competition binding assays were carried out using membrane preparations from transfected HN9.10 cells that constitutively expressed the mu opioid receptor.
Residue:
398
  
Inhibitor
Name:
BDBM50366357
Synonyms:
CHEMBL542036
Type:
Small organic molecule
Emp. Form.:
C27H28F2N2O2
Mol. Mass.:
450.5202
SMILES:
CN([C@H](CN1CC[C@H](O)C1)c1ccccc1)C(=O)C(c1ccc(F)cc1)c1ccc(F)cc1
: