Target
Protein kinase C beta type
Ligand
BDBM50285239
Substrate
Meas. Tech.
ChEMBL_160618 (CHEMBL768102)
IC50
3±n/a nM
Citation
 Lai, YMendoza, JHubbard, FKalter, K Synthesis and PKC inhibitory activities of balanol analogs with a cyclopentane substructure Bioorg Med Chem Lett 5:2155-2160 (1995)    Article 
Target
Name:
Protein kinase C beta type
Synonyms:
KPCB_HUMAN PKC beta PKCB PRKCB1 Protein kinase C beta type | Protein kinase C beta type II (PRKCB2)
Type:
Enzyme
Mol. Mass.:
76873.67
Organism:
Homo sapiens (Human)
Description:
The recombinant human PKC enzymes were produced using a baculovirus expression system in SF9 cells
Residue:
671
  
Inhibitor
Name:
BDBM50285239
Synonyms:
4-(2-Carboxy-6-hydroxy-benzoyl)-3,5-dihydroxy-benzoic acid (3S,5R)-2-((S)-4-hydroxy-benzoylamino)-4-hydroxymethyl-cyclopentyl ester | CHEMBL306427
Type:
Small organic molecule
Emp. Form.:
C28H25NO11
Mol. Mass.:
551.4982
SMILES:
OC[C@H]1C[C@H](NC(=O)c2ccc(O)cc2)[C@@H](C1)OC(=O)c1cc(O)c(C(=O)c2c(O)cccc2C(O)=O)c(O)c1
: