Target
Tissue alpha-L-fucosidase
Ligand
BDBM50065258
Substrate
Meas. Tech.
ChEMBL_216279 (CHEMBL819885)
Ki
6.2±n/a nM
Citation
 Witczak, ZJSun, JMielguj, R Synthesis of L-fucopyranosyl-4-thiodisaccharides from levoglucosenone and their inhibitory activity on -L-fucosidase Bioorg Med Chem Lett 5:2169-2174 (1995)    Article 
Target
Name:
Tissue alpha-L-fucosidase
Synonyms:
Alpha-L-fucosidase I FUCA1 Tissue alpha-L-fucosidase
Type:
PROTEIN
Mol. Mass.:
53690.69
Organism:
Homo sapiens (Human)
Description:
ChEMBL_34088
Residue:
466
  
Inhibitor
Name:
BDBM50065258
Synonyms:
(2S,3R,4S,5R)-2-Methyl-piperidine-3,4,5-triol CHEMBL314772 | Fucosidase Inhibitor, 3
Type:
Small organic molecule
Emp. Form.:
C6H13NO3
Mol. Mass.:
147.1723
SMILES:
C[C@@H]1NC[C@@H](O)[C@H](O)[C@@H]1O
: