Target
Beta-mannosidase
Ligand
BDBM50285807
Substrate
Meas. Tech.
ChEBML_41368
Ki
6000±n/a nM
Citation
 Bleriot, YDintinger, TGenre-Grandpierre, APadrines, MTellier, C Inhibition of glycosidases by substituted amidines Bioorg Med Chem Lett 5:2655-2660 (1995)    Article 
Target
Name:
Beta-mannosidase
Synonyms:
MANBA_RAT | Manba
Type:
PROTEIN
Mol. Mass.:
101229.60
Organism:
Rattus norvegicus
Description:
ChEMBL_41368
Residue:
881
  
Inhibitor
Name:
BDBM50285807
Synonyms:
CHEMBL2368787
Type:
Small organic molecule
Emp. Form.:
C13H18N2O4
Mol. Mass.:
266.293
SMILES:
OC[C@@H]1N=C(NCc2ccccc2)[C@@H](O)[C@@H](O)[C@@H]1O
: