Target
DNA topoisomerase 2-alpha/2-beta
Ligand
BDBM50286491
Substrate
Meas. Tech.
ChEMBL_208605 (CHEMBL812282)
EC50
3200±n/a nM
Citation
 Wentland, MPAldous, SCGruett, MDPerni, RBPowles, RGDanz, DWKlingbeil, KMPeverly, ARobinson, RGCorbett, THRake, JBCoughlin, SA The antitumor activity of novel pyrazoloquinoline derivatives Bioorg Med Chem Lett 5:405-410 (1995)    Article 
Target
Name:
DNA topoisomerase 2-alpha/2-beta
Synonyms:
DNA topoisomerase II
Type:
Mol. Mass.:
Description:
ASSAY_ID of ChEMBL is 1821483
Components:
This complex has 2 components.
Component 1
Name:
DNA topoisomerase 2-alpha
Synonyms:
DNA topoisomerase 2-alpha DNA topoisomerase II (Topo II) DNA topoisomerase II, alpha isozyme TOP2A Topoisomerase I/II | Topoisomerase II alpha (HuTopoIIα)
Type:
Protein
Mol. Mass.:
174415.30
Organism:
Homo sapiens (Human)
Description:
P11388
Residue:
1531
  
Component 2
Name:
DNA topoisomerase 2-beta
Synonyms:
DNA topoisomerase II TOP2B | TOP2B_HUMAN
Type:
PROTEIN
Mol. Mass.:
183284.13
Organism:
Homo sapiens (Human)
Description:
ChEMBL_51583
Residue:
1626
  
Inhibitor
Name:
BDBM50286491
Synonyms:
5-Cyclopropyl-7-(2,6-dimethyl-pyridin-4-yl)-6,8-difluoro-2-(1-methyl-piperidin-4-yl)-2,5-dihydro-pyrazolo[4,3-c]quinolin-3-one | CHEMBL129908
Type:
Small organic molecule
Emp. Form.:
C26H27F2N5O
Mol. Mass.:
463.5223
SMILES:
CN1CCC(CC1)n1nc2c(cn(C3CC3)c3c(F)c(c(F)cc23)-c2cc(C)nc(C)c2)c1=O
: